Target
Cannabinoid receptor 1
Ligand
BDBM50176988
Substrate
Meas. Tech.
ChEBML_1615644
Ki
126±n/a nM
Citation
 Lazzari, PDistinto, RManca, IBaillie, GMurineddu, GPira, MFalzoi, MSani, MMorales, PRoss, RZanda, MJagerovic, NPinna, GA A critical review of both the synthesis approach and the receptor profile of the 8-chloro-1-(2',4'-dichlorophenyl)-N-piperidin-1-yl-1,4,5,6-tetrahydrobenzo[6,7]cyclohepta[1,2-c]pyrazole-3-carboxamide and analogue derivatives. Eur J Med Chem 121:194-208 (2016)  
Target
Name:
Cannabinoid receptor 1
Synonyms:
CANN6 CB-R CNR CNR1_HUMAN Cannabinoid receptor Cannabinoid receptor 1 (brain)
Type:
G Protein-Coupled Receptor (GPCR)
Mol. Mass.:
52868.96
Organism:
Homo sapiens (Human)
Description:
P21554
Residue:
472
  
Inhibitor
Name:
BDBM50176988
Synonyms:
8-Chloro-1-(2,4-dichloro-phenyl)-1,3a,4,5,6,10b-hexahydro-1,2-diaza-benzo[e]azulene-3-carboxylic acid piperidin-1-ylamide 8-chloro-1-(2',4'-dichlorophenyl)-N-piperidin-1-yl-1,4,5,6-tetrahydrobenzo[6,7]cyclohepta[1,2-c]pyrazole-3-carboxamide CHEMBL376700
Type:
Small organic molecule
Emp. Form.:
C24H23Cl3N4O
Mol. Mass.:
489.825
SMILES:
Clc1ccc(c(Cl)c1)-n1nc(C(=O)NN2CCCCC2)c2CCCc3cc(Cl)ccc3-c12
: