Target
Cannabinoid receptor 1
Ligand
BDBM50193281
Substrate
Meas. Tech.
ChEBML_1615640
Ki
154±n/a nM
Citation
 Lazzari, PDistinto, RManca, IBaillie, GMurineddu, GPira, MFalzoi, MSani, MMorales, PRoss, RZanda, MJagerovic, NPinna, GA A critical review of both the synthesis approach and the receptor profile of the 8-chloro-1-(2',4'-dichlorophenyl)-N-piperidin-1-yl-1,4,5,6-tetrahydrobenzo[6,7]cyclohepta[1,2-c]pyrazole-3-carboxamide and analogue derivatives. Eur J Med Chem 121:194-208 (2016)  
Target
Name:
Cannabinoid receptor 1
Synonyms:
Brain-type cannabinoid receptor CB-R CNR1_MOUSE Cannabinoid receptor | Cnr1
Type:
Enzyme
Mol. Mass.:
52842.52
Organism:
Mus musculus (Mouse)
Description:
P47746
Residue:
473
  
Inhibitor
Name:
BDBM50193281
Synonyms:
CHEMBL3927357
Type:
Small organic molecule
Emp. Form.:
C26H27Cl3N2O
Mol. Mass.:
489.864
SMILES:
OC(CC1CCCCC1)c1nn(c-2c1CCCc1cc(Cl)ccc-21)-c1ccc(Cl)cc1Cl
: