Target
Cannabinoid receptor 2
Ligand
BDBM50193285
Substrate
Meas. Tech.
ChEBML_1615641
Ki
32±n/a nM
Citation
 Lazzari, PDistinto, RManca, IBaillie, GMurineddu, GPira, MFalzoi, MSani, MMorales, PRoss, RZanda, MJagerovic, NPinna, GA A critical review of both the synthesis approach and the receptor profile of the 8-chloro-1-(2',4'-dichlorophenyl)-N-piperidin-1-yl-1,4,5,6-tetrahydrobenzo[6,7]cyclohepta[1,2-c]pyrazole-3-carboxamide and analogue derivatives. Eur J Med Chem 121:194-208 (2016)  
Target
Name:
Cannabinoid receptor 2
Synonyms:
CANNABINOID CB2 CB2 CB2B CNR2_HUMAN Cannabinoid CB2 receptor Cannabinoid receptor 2 (CB2R) | hCB2
Type:
G Protein-Coupled Receptor (GPCR)
Mol. Mass.:
39690.94
Organism:
Homo sapiens (Human)
Description:
P34972
Residue:
360
  
Inhibitor
Name:
BDBM50193285
Synonyms:
CHEMBL3917142
Type:
Small organic molecule
Emp. Form.:
C26H26Cl3N3O
Mol. Mass.:
502.863
SMILES:
Clc1ccc(c(Cl)c1)-n1nc(C(=O)NCC2CCCCC2)c2CCCc3cc(Cl)ccc3-c12
: