Target
Chromobox protein homolog 7
Ligand
BDBM50194447
Substrate
Meas. Tech.
ChEMBL_1616628 (CHEMBL3858697)
IC50
1100±n/a nM
Citation
 Stuckey, JISimpson, CNorris-Drouin, JLCholensky, SHLee, JPasca, RCheng, NDickson, BMPearce, KHFrye, SVJames, LI Structure-Activity Relationships and Kinetic Studies of Peptidic Antagonists of CBX Chromodomains. J Med Chem 59:8913-8923 (2016)  
Target
Name:
Chromobox protein homolog 7
Synonyms:
CBX7 Chromobox protein homolog 7 | Chromobox protein homolog 7 (CBX7)
Type:
Protein
Mol. Mass.:
28351.76
Organism:
Homo sapiens (Human)
Description:
Residue:
251
  
Inhibitor
Name:
BDBM50194447
Synonyms:
CHEMBL3978944
Type:
Small organic molecule
Emp. Form.:
C44H62N6O8
Mol. Mass.:
802.9985
SMILES:
CCN(CC)CCCC[C@H](NC(=O)[C@H](CC(C)C)NC(=O)[C@H](C)NC(=O)[C@H](Cc1ccccc1)NC(=O)Cc1ccc2ccccc2c1)C(=O)N[C@@H](CO)C(=O)OC
: