Target
5'-AMP-activated protein kinase catalytic subunit alpha-1/subunit beta-1/subunit gamma-1
Ligand
BDBM50195475
Substrate
Meas. Tech.
ChEMBL_1617787 (CHEMBL3859856)
EC50
3.0±n/a nM
Citation
 Cameron, KOKurumbail, RG Recent progress in the identification of adenosine monophosphate-activated protein kinase (AMPK) activators. Bioorg Med Chem Lett 26:5139-5148 (2016)  
Target
Name:
5'-AMP-activated protein kinase catalytic subunit alpha-1/subunit beta-1/subunit gamma-1
Synonyms:
5'-AMP-activated protein kinase Complex 1 AMP-activated protein kinase (AMPK) alpha-1/beta-1/gamma-1 AMPK complex 1 (alpha-1,beta-1,gamma-1) Recombinant AMPK alpha1/beta1/gamma1 complex
Type:
Mol. Mass.:
Description:
Components:
This complex has 0 components.
Component 1
Name:
5'-AMP-activated protein kinase subunit beta-1
Synonyms:
5'-AMP-activated protein kinase subunit beta-1 AMP-activated protein kinase alpha-2/beta-1/gamma-3 AMPK subunit beta-1 PRKAB1
Type:
Mol. Mass.:
30380.94
Organism:
Homo sapiens (Human)
Description:
Q9Y478
Residue:
270
  
Component 2
Name:
5'-AMP-activated protein kinase subunit gamma-1
Synonyms:
5'-AMP-activated protein kinase subunit gamma-1 AMP-activated protein kinase, gamma-1 subunit AMPK gamma-1 AMPK subunit gamma-1 PRKAG1
Type:
Mol. Mass.:
37581.44
Organism:
Homo sapiens (Human)
Description:
P54619
Residue:
331
  
Component 3
Name:
5'-AMP-activated protein kinase catalytic subunit alpha-1
Synonyms:
AAPK1_HUMAN AMP-activated protein kinase alpha-1/beta-2/gamma-2 AMPK subunit alpha-1 AMPK1 PRKAA1 | Tau-protein kinase PRKAA1
Type:
Protein
Mol. Mass.:
64023.62
Organism:
Homo sapiens (Human)
Description:
Q13131
Residue:
559
  
Inhibitor
Name:
BDBM50195475
Synonyms:
CHEMBL3393127
Type:
Small organic molecule
Emp. Form.:
C24H18ClN3O3
Mol. Mass.:
431.871
SMILES:
Cc1ccc(Oc2nc3cc(c(Cl)cc3[nH]2)-c2ccc3n(C)ccc3c2)cc1C(O)=O
: