Target
Lysosomal acid glucosylceramidase
Ligand
BDBM50033284
Substrate
Meas. Tech.
ChEMBL_1618764 (CHEMBL3860933)
pH
5.9±n/a
IC50
5770±n/a nM
Comments
extracted
Citation
 Zheng, JChen, LSchwake, MSilverman, RBKrainc, D Design and Synthesis of Potent Quinazolines as Selectiveß-Glucocerebrosidase Modulators. J Med Chem 59:8508-20 (2016)  
Target
Name:
Lysosomal acid glucosylceramidase
Synonyms:
Acid beta-glucosidase Beta-glucocerebrosidase D-glucosyl-N-acylsphingosine glucohydrolase GBA1 GC GLUC Glucosylceramidase (GBA) Glucosylceramidase precursor (Beta-glucocerebrosidase) (Acid beta-glucosidase) (D-glucosyl-N-acylsphingosine glucohydrolase) (Alglucerase) (Imiglucerase) beta-glucocerebrosidase (GCase)
Type:
Enzyme
Mol. Mass.:
59724.64
Organism:
Homo sapiens (Human)
Description:
The beta-Glu activity was measured with commercially available beta-glucocerebrosidase (Ceredase) as the enzyme source.
Residue:
536
  
Inhibitor
Name:
BDBM50033284
Synonyms:
Benzyl-(2-pyridin-3-yl-quinazolin-4-yl)-amine US10167270, Compound 8b | cid_667555
Type:
Small organic molecule
Emp. Form.:
C20H16N4
Mol. Mass.:
312.3678
SMILES:
C(Nc1nc(nc2ccccc12)-c1cccnc1)c1ccccc1
: