Target
Lysosomal acid glucosylceramidase
Ligand
BDBM50196534
Substrate
Meas. Tech.
ChEMBL_1618764 (CHEMBL3860933)
pH
5.9±n/a
IC50
20±n/a nM
Comments
extracted
Citation
 Zheng, JChen, LSchwake, MSilverman, RBKrainc, D Design and Synthesis of Potent Quinazolines as Selectiveß-Glucocerebrosidase Modulators. J Med Chem 59:8508-20 (2016)  
Target
Name:
Lysosomal acid glucosylceramidase
Synonyms:
Acid beta-glucosidase Beta-glucocerebrosidase D-glucosyl-N-acylsphingosine glucohydrolase GBA1 GC GLUC Glucosylceramidase (GBA) Glucosylceramidase precursor (Beta-glucocerebrosidase) (Acid beta-glucosidase) (D-glucosyl-N-acylsphingosine glucohydrolase) (Alglucerase) (Imiglucerase) beta-glucocerebrosidase (GCase)
Type:
Enzyme
Mol. Mass.:
59724.64
Organism:
Homo sapiens (Human)
Description:
The beta-Glu activity was measured with commercially available beta-glucocerebrosidase (Ceredase) as the enzyme source.
Residue:
536
  
Inhibitor
Name:
BDBM50196534
Synonyms:
CHEMBL3956777
Type:
Small organic molecule
Emp. Form.:
C20H22N4
Mol. Mass.:
318.4155
SMILES:
C[C@H]1CC[C@@H](CC1)Nc1nc(nc2ccccc12)-c1cccnc1
: