Target
Lysosomal acid glucosylceramidase
Ligand
BDBM50196623
Substrate
Meas. Tech.
ChEMBL_1618765 (CHEMBL3860934)
pH
5±n/a
IC50
8.9±n/a nM
Comments
extracted
Citation
 Zheng, JChen, LSchwake, MSilverman, RBKrainc, D Design and Synthesis of Potent Quinazolines as Selectiveß-Glucocerebrosidase Modulators. J Med Chem 59:8508-20 (2016)  
Target
Name:
Lysosomal acid glucosylceramidase
Synonyms:
Acid beta-glucosidase Beta-glucocerebrosidase D-glucosyl-N-acylsphingosine glucohydrolase GBA1 GC GLUC Glucosylceramidase (GBA) Glucosylceramidase precursor (Beta-glucocerebrosidase) (Acid beta-glucosidase) (D-glucosyl-N-acylsphingosine glucohydrolase) (Alglucerase) (Imiglucerase) beta-glucocerebrosidase (GCase)
Type:
Enzyme
Mol. Mass.:
59724.64
Organism:
Homo sapiens (Human)
Description:
The beta-Glu activity was measured with commercially available beta-glucocerebrosidase (Ceredase) as the enzyme source.
Residue:
536
  
Inhibitor
Name:
BDBM50196623
Synonyms:
CHEMBL3976182 US10501435, Compound 11g
Type:
Small organic molecule
Emp. Form.:
C21H17N3S
Mol. Mass.:
343.445
SMILES:
C1C(Cc2ccccc12)Nc1nc(nc2ccccc12)-c1ccsc1
: