Target
Excitatory amino acid transporter 1
Ligand
BDBM50197050
Substrate
Meas. Tech.
ChEMBL_1619055 (CHEMBL3861224)
IC50
2512±n/a nM
Citation
 Hansen, JCBjørn-Yoshimoto, WEBisballe, NNielsen, BJensen, AABunch, L ß-Sulfonamido Functionalized Aspartate Analogues as Excitatory Amino Acid Transporter Inhibitors: Distinct Subtype Selectivity Profiles Arising from Subtle Structural Differences. J Med Chem 59:8771-8786 (2016)  
Target
Name:
Excitatory amino acid transporter 1
Synonyms:
EAA1_HUMAN Excitatory Amino Acid EAAT1 GLAST1 | SLC1A3
Type:
Enzyme Catalytic Domain
Mol. Mass.:
59577.19
Organism:
Homo sapiens (Human)
Description:
Excitatory Amino Acid EAAT1 0 HUMAN::P43003
Residue:
542
  
Inhibitor
Name:
BDBM50197050
Synonyms:
CHEMBL3920886
Type:
Small organic molecule
Emp. Form.:
C10H9F3N2O6S
Mol. Mass.:
342.248
SMILES:
N[C@@H](C(NS(=O)(=O)c1cc(F)c(F)cc1F)C(O)=O)C(O)=O
: