Target
Excitatory amino acid transporter 2
Ligand
BDBM50196924
Substrate
Meas. Tech.
ChEMBL_1619056 (CHEMBL3861225)
IC50
3020±n/a nM
Citation
 Hansen, JCBjørn-Yoshimoto, WEBisballe, NNielsen, BJensen, AABunch, L ß-Sulfonamido Functionalized Aspartate Analogues as Excitatory Amino Acid Transporter Inhibitors: Distinct Subtype Selectivity Profiles Arising from Subtle Structural Differences. J Med Chem 59:8771-8786 (2016)  
Target
Name:
Excitatory amino acid transporter 2
Synonyms:
EAA2_HUMAN GLT1 SLC1A2 Solute carrier family 1 member 2
Type:
Enzyme Catalytic Domain
Mol. Mass.:
62103.57
Organism:
Homo sapiens (Human)
Description:
Excitatory Amino Acid EAAT2 0 0::P43004
Residue:
574
  
Inhibitor
Name:
BDBM50196924
Synonyms:
CHEMBL3960774
Type:
Small organic molecule
Emp. Form.:
C10H11ClN2O6S
Mol. Mass.:
322.722
SMILES:
N[C@@H](C(NS(=O)(=O)c1ccc(Cl)cc1)C(O)=O)C(O)=O
: