Target
Fibroblast growth factor receptor 3
Ligand
BDBM130903
Substrate
Meas. Tech.
ChEMBL_1619703 (CHEMBL3861872)
IC50
130±n/a nM
Citation
 Ebiike, HTaka, NMatsushita, MOhmori, MTakami, KHyohdoh, IKohchi, MHayase, TNishii, HMorikami, KNakanishi, YAkiyama, NShindoh, HIshii, NIsobe, TMatsuoka, H Discovery of [5-Amino-1-(2-methyl-3H-benzimidazol-5-yl)pyrazol-4-yl]-(1H-indol-2-yl)methanone (CH5183284/Debio 1347), An Orally Available and Selective Fibroblast Growth Factor Receptor (FGFR) Inhibitor. J Med Chem 59:10586-10600 (2016)  
Target
Name:
Fibroblast growth factor receptor 3
Synonyms:
CD_antigen: CD333 FGFR3 Fibroblast growth factor receptor JTK4
Type:
Protein
Mol. Mass.:
87699.57
Organism:
Homo sapiens (Human)
Description:
P22607
Residue:
806
  
Inhibitor
Name:
BDBM130903
Synonyms:
US10689705, Compound 7 | US8829199, 196
Type:
Small organic molecule
Emp. Form.:
C26H25F2N7O
Mol. Mass.:
489.5198
SMILES:
Cc1nc2cc(ccc2[nH]1)-n1ncc(C(=O)c2cc3ccc(CN4CCC(F)(F)CC4)cc3[nH]2)c1N
: