Target
Cholinesterase
Ligand
BDBM50197879
Substrate
Meas. Tech.
ChEMBL_1620015 (CHEMBL3862298)
IC50
2.0±n/a nM
Citation
 Wu, MYEsteban, GBrogi, SShionoya, MWang, LCampiani, GUnzeta, MInokuchi, TButini, SMarco-Contelles, J Donepezil-like multifunctional agents: Design, synthesis, molecular modeling and biological evaluation. Eur J Med Chem 121:864-879 (2016)  
Target
Name:
Cholinesterase
Synonyms:
Acylcholine acylhydrolase Butyrylcholine esterase (BChE) Butyrylcholinesterase (BuChE) CHLE_HUMAN Cholinesterases Pseudocholinesterase
Type:
Homotetramer
Mol. Mass.:
68422.27
Organism:
Homo sapiens (Human)
Description:
P06276
Residue:
602
  
Inhibitor
Name:
BDBM50197879
Synonyms:
CHEMBL3972214
Type:
Small organic molecule
Emp. Form.:
C28H30N4O
Mol. Mass.:
438.564
SMILES:
Oc1cccc2ccc(CN(CC#C)C(CC3CCN(Cc4ccccc4)CC3)C#N)nc12
: