Target
Cathepsin B
Ligand
BDBM50197886
Substrate
Meas. Tech.
ChEBML_1620100
IC50
57±n/a nM
Citation
 Plebanek, EChevrier, FRoy, VGarenne, TLecaille, FWarszycki, DBojarski, AJLalmanach, GAgrofoglio, LA Straightforward synthesis of 2,4,6-trisubstituted 1,3,5-triazine compounds targeting cysteine cathepsins K and S. Eur J Med Chem 121:12-20 (2016)  
Target
Name:
Cathepsin B
Synonyms:
APP secretase CATB_HUMAN CTSB Cathepsin B light chain | Cathepsin B1
Type:
Enzyme
Mol. Mass.:
37819.69
Organism:
Homo sapiens (Human)
Description:
gi_63102437
Residue:
339
  
Inhibitor
Name:
BDBM50197886
Synonyms:
CHEMBL3936923
Type:
Small organic molecule
Emp. Form.:
C16H19N7
Mol. Mass.:
309.369
SMILES:
Cc1cccc(CNc2nc(nc(n2)N2CCNCC2)C#N)c1
: