Target
Cathepsin K
Ligand
BDBM50197887
Substrate
Meas. Tech.
ChEBML_1620101
IC50
68±n/a nM
Citation
 Plebanek, EChevrier, FRoy, VGarenne, TLecaille, FWarszycki, DBojarski, AJLalmanach, GAgrofoglio, LA Straightforward synthesis of 2,4,6-trisubstituted 1,3,5-triazine compounds targeting cysteine cathepsins K and S. Eur J Med Chem 121:12-20 (2016)  
Target
Name:
Cathepsin K
Synonyms:
CATK_HUMAN CTSO Cathepsin O Cathepsin X
Type:
Enzyme
Mol. Mass.:
36975.68
Organism:
Homo sapiens (Human)
Description:
P43235
Residue:
329
  
Inhibitor
Name:
BDBM50197887
Synonyms:
CHEMBL3899928
Type:
Small organic molecule
Emp. Form.:
C16H19N7O
Mol. Mass.:
325.3684
SMILES:
O[C@@H](CNc1nc(nc(n1)N1CCNCC1)C#N)c1ccccc1
: