Target
Cathepsin S
Ligand
BDBM50197888
Substrate
Meas. Tech.
ChEBML_1620103
IC50
23±n/a nM
Citation
 Plebanek, EChevrier, FRoy, VGarenne, TLecaille, FWarszycki, DBojarski, AJLalmanach, GAgrofoglio, LA Straightforward synthesis of 2,4,6-trisubstituted 1,3,5-triazine compounds targeting cysteine cathepsins K and S. Eur J Med Chem 121:12-20 (2016)  
Target
Name:
Cathepsin S
Synonyms:
CATS_HUMAN Cathepsin S (Cat S) | cathepsin S preproprotein
Type:
Protein
Mol. Mass.:
37507.38
Organism:
Homo sapiens (Human)
Description:
P25774
Residue:
331
  
Inhibitor
Name:
BDBM50197888
Synonyms:
CHEMBL3902967
Type:
Small organic molecule
Emp. Form.:
C15H14F3N7
Mol. Mass.:
349.3138
SMILES:
FC(F)(F)c1ccc(Nc2nc(nc(n2)N2CCNCC2)C#N)cc1
: