Target
Cathepsin K
Ligand
BDBM50197889
Substrate
Meas. Tech.
ChEBML_1620101
IC50
60±n/a nM
Citation
 Plebanek, EChevrier, FRoy, VGarenne, TLecaille, FWarszycki, DBojarski, AJLalmanach, GAgrofoglio, LA Straightforward synthesis of 2,4,6-trisubstituted 1,3,5-triazine compounds targeting cysteine cathepsins K and S. Eur J Med Chem 121:12-20 (2016)  
Target
Name:
Cathepsin K
Synonyms:
CATK_HUMAN CTSO Cathepsin O Cathepsin X
Type:
Enzyme
Mol. Mass.:
36975.68
Organism:
Homo sapiens (Human)
Description:
P43235
Residue:
329
  
Inhibitor
Name:
BDBM50197889
Synonyms:
CHEMBL3922171
Type:
Small organic molecule
Emp. Form.:
C18H22N6
Mol. Mass.:
322.4075
SMILES:
Cc1cccc(CNc2nc(NC3CCCCC3)nc(n2)C#N)c1
: