Target
Procathepsin L
Ligand
BDBM50197887
Substrate
Meas. Tech.
ChEBML_1620102
IC50
45±n/a nM
Citation
 Plebanek, EChevrier, FRoy, VGarenne, TLecaille, FWarszycki, DBojarski, AJLalmanach, GAgrofoglio, LA Straightforward synthesis of 2,4,6-trisubstituted 1,3,5-triazine compounds targeting cysteine cathepsins K and S. Eur J Med Chem 121:12-20 (2016)  
Target
Name:
Procathepsin L
Synonyms:
CATL1_HUMAN CTSL CTSL1 Cathepsin L Cathepsin L1 heavy chain MEP cathepsin L preproprotein
Type:
Enzyme
Mol. Mass.:
37557.19
Organism:
Homo sapiens (Human)
Description:
Purchased from Calbiochem (San Diego, CA).
Residue:
333
  
Inhibitor
Name:
BDBM50197887
Synonyms:
CHEMBL3899928
Type:
Small organic molecule
Emp. Form.:
C16H19N7O
Mol. Mass.:
325.3684
SMILES:
O[C@@H](CNc1nc(nc(n1)N1CCNCC1)C#N)c1ccccc1
: