Target
Cathepsin K
Ligand
BDBM50197923
Substrate
Meas. Tech.
ChEMBL_1620101 (CHEMBL3862384)
IC50
17±n/a nM
Citation
 Plebanek, EChevrier, FRoy, VGarenne, TLecaille, FWarszycki, DBojarski, AJLalmanach, GAgrofoglio, LA Straightforward synthesis of 2,4,6-trisubstituted 1,3,5-triazine compounds targeting cysteine cathepsins K and S. Eur J Med Chem 121:12-20 (2016)  
Target
Name:
Cathepsin K
Synonyms:
CATK_HUMAN CTSO Cathepsin O Cathepsin X
Type:
Enzyme
Mol. Mass.:
36975.68
Organism:
Homo sapiens (Human)
Description:
P43235
Residue:
329
  
Inhibitor
Name:
BDBM50197923
Synonyms:
CHEMBL3962225
Type:
Small organic molecule
Emp. Form.:
C14H14N8O2
Mol. Mass.:
326.3134
SMILES:
[O-][N+](=O)c1ccc(Nc2nc(nc(n2)N2CCNCC2)C#N)cc1
: