Target
Cathepsin K
Ligand
BDBM50197925
Substrate
Meas. Tech.
ChEMBL_1620101 (CHEMBL3862384)
IC50
70±n/a nM
Citation
 Plebanek, EChevrier, FRoy, VGarenne, TLecaille, FWarszycki, DBojarski, AJLalmanach, GAgrofoglio, LA Straightforward synthesis of 2,4,6-trisubstituted 1,3,5-triazine compounds targeting cysteine cathepsins K and S. Eur J Med Chem 121:12-20 (2016)  
Target
Name:
Cathepsin K
Synonyms:
CATK_HUMAN CTSO Cathepsin O Cathepsin X
Type:
Enzyme
Mol. Mass.:
36975.68
Organism:
Homo sapiens (Human)
Description:
P43235
Residue:
329
  
Inhibitor
Name:
BDBM50197925
Synonyms:
CHEMBL3905213
Type:
Small organic molecule
Emp. Form.:
C18H22N6O
Mol. Mass.:
338.4069
SMILES:
O[C@@H](CNc1nc(NC2CCCCC2)nc(n1)C#N)c1ccccc1
: