Target
Procathepsin L
Ligand
BDBM50197927
Substrate
Meas. Tech.
ChEMBL_1620102 (CHEMBL3862385)
IC50
113±n/a nM
Citation
 Plebanek, EChevrier, FRoy, VGarenne, TLecaille, FWarszycki, DBojarski, AJLalmanach, GAgrofoglio, LA Straightforward synthesis of 2,4,6-trisubstituted 1,3,5-triazine compounds targeting cysteine cathepsins K and S. Eur J Med Chem 121:12-20 (2016)  
Target
Name:
Procathepsin L
Synonyms:
CATL1_HUMAN CTSL CTSL1 Cathepsin L Cathepsin L1 heavy chain MEP cathepsin L preproprotein
Type:
Enzyme
Mol. Mass.:
37557.19
Organism:
Homo sapiens (Human)
Description:
Purchased from Calbiochem (San Diego, CA).
Residue:
333
  
Inhibitor
Name:
BDBM50197927
Synonyms:
CHEMBL3927922
Type:
Small organic molecule
Emp. Form.:
C15H14N8
Mol. Mass.:
306.3253
SMILES:
N#Cc1ccc(Nc2nc(nc(n2)N2CCNCC2)C#N)cc1
: