Target
Cathepsin K
Ligand
BDBM50197929
Substrate
Meas. Tech.
ChEMBL_1620101 (CHEMBL3862384)
IC50
17±n/a nM
Citation
 Plebanek, EChevrier, FRoy, VGarenne, TLecaille, FWarszycki, DBojarski, AJLalmanach, GAgrofoglio, LA Straightforward synthesis of 2,4,6-trisubstituted 1,3,5-triazine compounds targeting cysteine cathepsins K and S. Eur J Med Chem 121:12-20 (2016)  
Target
Name:
Cathepsin K
Synonyms:
CATK_HUMAN CTSO Cathepsin O Cathepsin X
Type:
Enzyme
Mol. Mass.:
36975.68
Organism:
Homo sapiens (Human)
Description:
P43235
Residue:
329
  
Inhibitor
Name:
BDBM50197929
Synonyms:
CHEMBL3954506
Type:
Small organic molecule
Emp. Form.:
C16H17N7O2
Mol. Mass.:
339.3519
SMILES:
[O-][N+](=O)c1cccc(Nc2nc(NC3CCCCC3)nc(n2)C#N)c1
: