Target
Cathepsin S
Ligand
BDBM50197886
Substrate
Meas. Tech.
ChEMBL_1620103 (CHEMBL3862386)
IC50
17±n/a nM
Citation
 Plebanek, EChevrier, FRoy, VGarenne, TLecaille, FWarszycki, DBojarski, AJLalmanach, GAgrofoglio, LA Straightforward synthesis of 2,4,6-trisubstituted 1,3,5-triazine compounds targeting cysteine cathepsins K and S. Eur J Med Chem 121:12-20 (2016)  
Target
Name:
Cathepsin S
Synonyms:
CATS_HUMAN Cathepsin S (Cat S) | cathepsin S preproprotein
Type:
Protein
Mol. Mass.:
37507.38
Organism:
Homo sapiens (Human)
Description:
P25774
Residue:
331
  
Inhibitor
Name:
BDBM50197886
Synonyms:
CHEMBL3936923
Type:
Small organic molecule
Emp. Form.:
C16H19N7
Mol. Mass.:
309.369
SMILES:
Cc1cccc(CNc2nc(nc(n2)N2CCNCC2)C#N)c1
: