Target
Cathepsin B
Ligand
BDBM50197927
Substrate
Meas. Tech.
ChEMBL_1620100 (CHEMBL3862383)
IC50
57±n/a nM
Citation
 Plebanek, EChevrier, FRoy, VGarenne, TLecaille, FWarszycki, DBojarski, AJLalmanach, GAgrofoglio, LA Straightforward synthesis of 2,4,6-trisubstituted 1,3,5-triazine compounds targeting cysteine cathepsins K and S. Eur J Med Chem 121:12-20 (2016)  
Target
Name:
Cathepsin B
Synonyms:
APP secretase CATB_HUMAN CTSB Cathepsin B light chain | Cathepsin B1
Type:
Enzyme
Mol. Mass.:
37819.69
Organism:
Homo sapiens (Human)
Description:
gi_63102437
Residue:
339
  
Inhibitor
Name:
BDBM50197927
Synonyms:
CHEMBL3927922
Type:
Small organic molecule
Emp. Form.:
C15H14N8
Mol. Mass.:
306.3253
SMILES:
N#Cc1ccc(Nc2nc(nc(n2)N2CCNCC2)C#N)cc1
: