Target
Coagulation factor X
Ligand
BDBM50198653
Substrate
Meas. Tech.
ChEMBL_1620815 (CHEMBL3863098)
IC50
350±n/a nM
Citation
 Wang, YSun, XYang, DGuo, ZFan, XNie, MZhang, FLiu, YLi, YWang, YGong, PLiu, Y Design, synthesis, and structure-activity relationship of novel and effective apixaban derivatives as FXa inhibitors containing 1,2,4-triazole/pyrrole derivatives as P2 binding element. Bioorg Med Chem 24:5646-5661 (2016)  
Target
Name:
Coagulation factor X
Synonyms:
Activated coagulation factor X (FXa) Coagulation factor X precursor F10 Factor X heavy chain Factor Xa Stuart-Prower factor
Type:
Enzyme
Mol. Mass.:
54726.60
Organism:
Homo sapiens (Human)
Description:
Residue:
488
  
Inhibitor
Name:
BDBM50198653
Synonyms:
CHEMBL3985923
Type:
Small organic molecule
Emp. Form.:
C24H24N6O3
Mol. Mass.:
444.4858
SMILES:
COc1ccc(cc1)-n1nc(C(N)=O)c2CCN(C(=O)c12)c1ccc(cc1)C1=NCCCN1
: