Target
Phosphatidylinositol 4-kinase type 2-alpha
Ligand
BDBM50199888
Substrate
Meas. Tech.
ChEMBL_1621779 (CHEMBL3864062)
IC50
>10000±n/a nM
Citation
 Mejdrová, IChalupská, DPlacková, PMüller, C?ála, MKlíma, MBaumlová, AHrebabecký, HProcházková, EDejmek, MStrunin, DWeber, JLee, GMatou?ová, MMertlíková-Kaiserová, HZiebuhr, JBirkus, GBoura, ENencka, R Rational Design of Novel Highly Potent and Selective Phosphatidylinositol 4-Kinase IIIß (PI4KB) Inhibitors as Broad-Spectrum Antiviral Agents and Tools for Chemical Biology. J Med Chem 60:100-118 (2017)  
Target
Name:
Phosphatidylinositol 4-kinase type 2-alpha
Synonyms:
P4K2A_HUMAN Phosphatidylinositol 4-kinase type 2-alpha | Phosphatidylinositol 4-kinase type II-alpha
Type:
PROTEIN
Mol. Mass.:
54030.26
Organism:
Homo sapiens (Human)
Description:
ChEMBL_104812
Residue:
479
  
Inhibitor
Name:
BDBM50199888
Synonyms:
CHEMBL3976651
Type:
Small organic molecule
Emp. Form.:
C24H27ClN6O4S
Mol. Mass.:
531.027
SMILES:
CCc1cc(CNc2cc(Cl)nn3c(c(C)nc23)-c2ccc(OC)c(c2)S(=O)(=O)NCCO)ccn1
: