Target
UDP-3-O-acyl-N-acetylglucosamine deacetylase
Ligand
BDBM50200120
Substrate
Meas. Tech.
ChEMBL_1621918 (CHEMBL3864270)
IC50
<2.1±n/a nM
Citation
 Brown, DG Drug discovery strategies to outer membrane targets in Gram-negative pathogens. Bioorg Med Chem 24:6320-6331 (2016)  
Target
Name:
UDP-3-O-acyl-N-acetylglucosamine deacetylase
Synonyms:
LPXC_PSEAE UDP-3-O-[3-hydroxymyristoyl] N-acetylglucosamine deacetylase UDP-3-O-[3-hydroxymyristoyl] N-acetylglucosamine deacetylase (LpxC) UDP-3-O-acyl-GlcNAc deacetylase (LpxC) lpxC
Type:
Enzyme
Mol. Mass.:
33428.15
Organism:
Pseudomonas aeruginosa
Description:
P47205
Residue:
303
  
Inhibitor
Name:
BDBM50200120
Synonyms:
CHEMBL260091 US10875832, Compound ChIR-090
Type:
Small organic molecule
Emp. Form.:
C24H27N3O5
Mol. Mass.:
437.4883
SMILES:
C[C@@H](O)[C@H](NC(=O)c1ccc(cc1)C#Cc1ccc(CN2CCOCC2)cc1)C(=O)NO
: