Target
Adenosine receptor A2a
Ligand
BDBM50200982
Substrate
Meas. Tech.
ChEMBL_1622887 (CHEMBL3865239)
Ki
1.000000±n/a nM
Citation
 Rosse, G Quinazoline Carboxamides as Selective Antagonists of Adenosine 2A Receptor. ACS Med Chem Lett 7:1014-1015 (2016)  
Target
Name:
Adenosine receptor A2a
Synonyms:
A2A adenosine receptor (hA2A) ADENOSINE A2 ADORA2 Adenosine A2A receptor (A2AAR)
Type:
G Protein-Coupled Receptor (GPCR)
Mol. Mass.:
44716.46
Organism:
Homo sapiens (Human)
Description:
P29274
Residue:
412
  
Inhibitor
Name:
BDBM50200982
Synonyms:
CHEMBL3911977
Type:
Small organic molecule
Emp. Form.:
C19H20FN5O2
Mol. Mass.:
369.3928
SMILES:
CC(C)OCc1cccc(CNC(=O)c2nc(N)nc3c(F)cccc23)n1
: