Target
Adenosine receptor A2a
Ligand
BDBM50200984
Substrate
Meas. Tech.
ChEMBL_1622887 (CHEMBL3865239)
Ki
0.400000±n/a nM
Citation
 Rosse, G Quinazoline Carboxamides as Selective Antagonists of Adenosine 2A Receptor. ACS Med Chem Lett 7:1014-1015 (2016)  
Target
Name:
Adenosine receptor A2a
Synonyms:
A2A adenosine receptor (hA2A) ADENOSINE A2 ADORA2 Adenosine A2A receptor (A2AAR)
Type:
G Protein-Coupled Receptor (GPCR)
Mol. Mass.:
44716.46
Organism:
Homo sapiens (Human)
Description:
P29274
Residue:
412
  
Inhibitor
Name:
BDBM50200984
Synonyms:
CHEMBL3932655 | US10138212, Example 9
Type:
Small organic molecule
Emp. Form.:
C19H21N5O3
Mol. Mass.:
367.4017
SMILES:
COc1cccc2c(nc(N)nc12)C(=O)NCc1cccc(n1)C(C)(C)O
: