Target
Adenosine receptor A2a
Ligand
BDBM50200989
Substrate
Meas. Tech.
ChEMBL_1622887 (CHEMBL3865239)
Ki
0.400000±n/a nM
Citation
 Rosse, G Quinazoline Carboxamides as Selective Antagonists of Adenosine 2A Receptor. ACS Med Chem Lett 7:1014-1015 (2016)  
Target
Name:
Adenosine receptor A2a
Synonyms:
A2A adenosine receptor (hA2A) ADENOSINE A2 ADORA2 Adenosine A2A receptor (A2AAR)
Type:
G Protein-Coupled Receptor (GPCR)
Mol. Mass.:
44716.46
Organism:
Homo sapiens (Human)
Description:
P29274
Residue:
412
  
Inhibitor
Name:
BDBM50200989
Synonyms:
CHEMBL3906827 | US10138212, Example 18
Type:
Small organic molecule
Emp. Form.:
C17H14F3N5O2
Mol. Mass.:
377.3206
SMILES:
COc1cccc2c(nc(N)nc12)C(=O)NCc1cccc(n1)C(F)(F)F
: