Target
Adenosine receptor A2a
Ligand
BDBM50201020
Substrate
Meas. Tech.
ChEMBL_1622887 (CHEMBL3865239)
Ki
0.600000±n/a nM
Citation
 Rosse, G Quinazoline Carboxamides as Selective Antagonists of Adenosine 2A Receptor. ACS Med Chem Lett 7:1014-1015 (2016)  
Target
Name:
Adenosine receptor A2a
Synonyms:
A2A adenosine receptor (hA2A) ADENOSINE A2 ADORA2 Adenosine A2A receptor (A2AAR)
Type:
G Protein-Coupled Receptor (GPCR)
Mol. Mass.:
44716.46
Organism:
Homo sapiens (Human)
Description:
P29274
Residue:
412
  
Inhibitor
Name:
BDBM50201020
Synonyms:
CHEMBL3951425 | US10138212, Example 2
Type:
Small organic molecule
Emp. Form.:
C20H23N5O3
Mol. Mass.:
381.4283
SMILES:
COc1cccc2c(nc(N)nc12)C(=O)NCc1nc(ccc1C)C(C)(C)O
: