Target
N-acetyltransferase Eis
Ligand
BDBM50201739
Substrate
Meas. Tech.
ChEMBL_1623397 (CHEMBL3865749)
IC50
5800±n/a nM
Citation
 Garzan, AWillby, MJGreen, KDTsodikov, OVPosey, JEGarneau-Tsodikova, S Discovery and Optimization of Two Eis Inhibitor Families as Kanamycin Adjuvants against Drug-Resistant ACS Med Chem Lett 7:1219-1221 (2016)  
Target
Name:
N-acetyltransferase Eis
Synonyms:
Aminoglycoside N-acetyltransferase Enhanced intracellular survival protein Protein-lysine N-acetyltransferase | eis
Type:
PROTEIN
Mol. Mass.:
43803.37
Organism:
Mycobacterium tuberculosis (strain ATCC 25618 / H37Rv)
Description:
ChEMBL_116995
Residue:
402
  
Inhibitor
Name:
BDBM50201739
Synonyms:
CHEMBL3909271
Type:
Small organic molecule
Emp. Form.:
C17H15NO4
Mol. Mass.:
297.3053
SMILES:
COC(=O)c1cc2occc2n1CC(=O)c1ccc(C)cc1
: