Target
N-acetyltransferase Eis
Ligand
BDBM50201741
Substrate
Meas. Tech.
ChEMBL_1623397 (CHEMBL3865749)
IC50
1200±n/a nM
Citation
 Garzan, AWillby, MJGreen, KDTsodikov, OVPosey, JEGarneau-Tsodikova, S Discovery and Optimization of Two Eis Inhibitor Families as Kanamycin Adjuvants against Drug-Resistant ACS Med Chem Lett 7:1219-1221 (2016)  
Target
Name:
N-acetyltransferase Eis
Synonyms:
Aminoglycoside N-acetyltransferase Enhanced intracellular survival protein Protein-lysine N-acetyltransferase | eis
Type:
PROTEIN
Mol. Mass.:
43803.37
Organism:
Mycobacterium tuberculosis (strain ATCC 25618 / H37Rv)
Description:
ChEMBL_116995
Residue:
402
  
Inhibitor
Name:
BDBM50201741
Synonyms:
CHEMBL3915019
Type:
Small organic molecule
Emp. Form.:
C18H14N2O6
Mol. Mass.:
354.3136
SMILES:
[O-][N+](=O)c1cccc(c1)C(=O)CN1C(=O)C2(OCCO2)c2ccccc12
: