Target
Cyclin-dependent kinase 6
Ligand
BDBM50202485
Substrate
Meas. Tech.
ChEMBL_1624421 (CHEMBL3866833)
IC50
18±n/a nM
Citation
 Wang, PHuang, JWang, KGu, Y New palbociclib analogues modified at the terminal piperazine ring and their anticancer activities. Eur J Med Chem 122:546-556 (2016)  
Target
Name:
Cyclin-dependent kinase 6
Synonyms:
CDK6 CDKN6 Cyclin-dependent kinase 6 (CDK 6) | Serine/threonine-protein kinase PLSTIRE
Type:
Enzyme Subunit
Mol. Mass.:
36937.42
Organism:
Homo sapiens (Human)
Description:
Q00534
Residue:
326
  
Inhibitor
Name:
BDBM50202485
Synonyms:
CHEMBL3905696
Type:
Small organic molecule
Emp. Form.:
C30H40N8O4
Mol. Mass.:
576.6898
SMILES:
COCCCNCC(=O)N1CCN(CC1)c1ccc(Nc2ncc3c(C)c(C(C)=O)c(=O)n(C4CCCC4)c3n2)nc1
: