Target
Acetylcholinesterase
Ligand
BDBM50202494
Substrate
Meas. Tech.
ChEMBL_1624443 (CHEMBL3866855)
Ki
850±n/a nM
Citation
 Kulshreshtha, APiplani, P Ameliorative effects of amide derivatives of 1,3,4-thiadiazoles on scopolamine induced cognitive dysfunction. Eur J Med Chem 122:557-573 (2016)  
Target
Name:
Acetylcholinesterase
Synonyms:
ACES_MOUSE Acetylcholinesterase (mouse AChE) Ache
Type:
Enzyme
Mol. Mass.:
68165.65
Organism:
Mus musculus (mouse)
Description:
Residue:
614
  
Inhibitor
Name:
BDBM50202494
Synonyms:
CHEMBL3893245
Type:
Small organic molecule
Emp. Form.:
C16H12ClN3OS
Mol. Mass.:
329.804
SMILES:
ClCc1cccc(c1)C(=O)Nc1nnc(s1)-c1ccccc1
: