Target
Cannabinoid receptor 2
Ligand
BDBM50202519
Substrate
Meas. Tech.
ChEMBL_1624520 (CHEMBL3866932)
Ki
2.2±n/a nM
Citation
 Osman, NALigresti, AKlein, CDAllarà, MRabbito, ADi Marzo, VAbouzid, KAAbadi, AH Discovery of novel Tetrahydrobenzo[b]thiophene and pyrrole based scaffolds as potent and selective CB2 receptor ligands: The structural elements controlling binding affinity, selectivity and functionality. Eur J Med Chem 122:619-634 (2016)  
Target
Name:
Cannabinoid receptor 2
Synonyms:
CANNABINOID CB2 CB2 CB2B CNR2_HUMAN Cannabinoid CB2 receptor Cannabinoid receptor 2 (CB2R) | hCB2
Type:
G Protein-Coupled Receptor (GPCR)
Mol. Mass.:
39690.94
Organism:
Homo sapiens (Human)
Description:
P34972
Residue:
360
  
Inhibitor
Name:
BDBM50202519
Synonyms:
CHEMBL3909238
Type:
Small organic molecule
Emp. Form.:
C22H29NO3S
Mol. Mass.:
387.536
SMILES:
CCOC(=O)c1c(NC(=O)C23CC4CC(CC(C4)C2)C3)sc2CCCCc12
: