Target
Cytochrome P450 11B1, mitochondrial
Ligand
BDBM50203334
Substrate
Meas. Tech.
ChEMBL_1625604 (CHEMBL3868073)
IC50
187±n/a nM
Citation
 Blass, BEIyer, PAbou-Gharbia, MChilders, WEGordon, JCRamanjulu, MMorton, GArumugam, PBoruwa, JEllingboe, JMitra, SNimmareddy, RRPaliwal, SRajasekhar, JShivakumar, SSrivastava, PTangirala, RSVenkataramanaiah, KYanamandra, M Design, synthesis, and evaluation of (2S,4R)-Ketoconazole sulfonamide analogs as potential treatments for Metabolic Syndrome. Bioorg Med Chem Lett 26:5825-5829 (2016)  
Target
Name:
Cytochrome P450 11B1, mitochondrial
Synonyms:
C11B1_HUMAN CYPXIB1 Cytochrome P450 11B1 Cytochrome P450 11B1, mitochondrial | S11BH
Type:
Enzyme
Mol. Mass.:
57591.44
Organism:
Homo sapiens (Human)
Description:
P15538
Residue:
503
  
Inhibitor
Name:
BDBM50203334
Synonyms:
CHEMBL3931836
Type:
Small organic molecule
Emp. Form.:
C29H34Cl2N4O6S
Mol. Mass.:
637.574
SMILES:
Clc1ccc(c(Cl)c1)[C@]1(Cn2ccnc2)OC[C@@H](COc2ccc(cc2)N2CCN(CC2)S(=O)(=O)C2CCOCC2)O1
: