Target
Glucocorticoid receptor
Ligand
BDBM50203418
Substrate
Meas. Tech.
ChEMBL_1625691 (CHEMBL3868160)
IC50
9±n/a nM
Citation
 Hemmerling, MEdman, KLepistö, MEriksson, AIvanova, SDahmén, JRehwinkel, HBerger, MHendrickx, RDearman, MJensen, TJWissler, LHansson, T Discovery of indazole ethers as novel, potent, non-steroidal glucocorticoid receptor modulators. Bioorg Med Chem Lett 26:5741-5748 (2016)  
Target
Name:
Glucocorticoid receptor
Synonyms:
GCR_HUMAN GRL Glucocorticoid receptor (GRFP) Nuclear receptor subfamily 3 group C member 1
Type:
Enzyme
Mol. Mass.:
85656.87
Organism:
Homo sapiens (Human)
Description:
P04150
Residue:
777
  
Inhibitor
Name:
BDBM50203418
Synonyms:
CHEMBL3902818
Type:
Small organic molecule
Emp. Form.:
C28H21F4N3O2
Mol. Mass.:
507.4789
SMILES:
C[C@H](NC(=O)C(F)(F)F)[C@H](Oc1ccc2n(ncc2c1)-c1ccc(F)cc1)c1ccc2ccccc2c1
: