Target
Oxysterols receptor LXR-beta/Retinoic acid receptor RXR-alpha
Ligand
BDBM50204076
Substrate
Meas. Tech.
ChEMBL_1626045 (CHEMBL3868514)
Ki
11±n/a nM
Citation
 Kick, EKBusch, BBMartin, RStevens, WCBollu, VXie, YBoren, BCNyman, MCNanao, MHNguyen, LPlonowski, ASchulman, IGYan, GZhang, HHou, XValente, MNNarayanan, RBehnia, KRodrigues, ADBrock, BSmalley, JCantor, GHLupisella, JSleph, PGrimm, DOstrowski, JWexler, RRKirchgessner, TMohan, R Discovery of Highly Potent Liver X Receptorß Agonists. ACS Med Chem Lett 7:1207-1212 (2016)  
Target
Name:
Oxysterols receptor LXR-beta/Retinoic acid receptor RXR-alpha
Synonyms:
Retinoic acid receptor RXR-alpha/oxysterols receptor LXR-beta
Type:
Mol. Mass.:
Description:
ASSAY_ID of ChEMBL is 2032722
Components:
This complex has 2 components.
Component 1
Name:
Retinoic acid receptor RXR-alpha
Synonyms:
NR2B1 Nuclear receptor subfamily 4 group A member 2 RXRA Retinoic acid receptor RXR-alpha/gamma Retinoid receptor
Type:
PROTEIN
Mol. Mass.:
50820.38
Organism:
Homo sapiens (Human)
Description:
ChEMBL_1456363
Residue:
462
  
Component 2
Name:
Oxysterols receptor LXR-beta
Synonyms:
LXRB Liver X, LXR beta NR1H2 Nuclear receptor NER Ubiquitously-expressed nuclear receptor
Type:
Enzyme Catalytic Domain
Mol. Mass.:
50978.79
Organism:
Homo sapiens (Human)
Description:
P55055
Residue:
460
  
Inhibitor
Name:
BDBM50204076
Synonyms:
CHEMBL3890276
Type:
Small organic molecule
Emp. Form.:
C28H28Cl2N2O3S
Mol. Mass.:
543.505
SMILES:
CC(C)(O)c1cn(c(n1)C(C)(C)c1c(Cl)cccc1Cl)-c1ccc(cc1)-c1cccc(c1)S(C)(=O)=O
: