Target
Androgen receptor
Ligand
BDBM50204249
Substrate
Meas. Tech.
ChEMBL_1627004 (CHEMBL3869525)
Ki
8.0±n/a nM
Citation
 Shan, WBalog, ANation, AZhu, XChen, JCvijic, MEGeng, JRizzo, CASpires, TAttar, RMObermeier, MTraeger, SDai, JZhang, YGalella, MTrainor, GVite, GDGavai, AV [2.2.1]-Bicyclic sultams as potent androgen receptor antagonists. Bioorg Med Chem Lett 26:5707-5711 (2016)  
Target
Name:
Androgen receptor
Synonyms:
ANDR_HUMAN Androgen Receptor Androgen receptor/Baculoviral IAP repeat-containing protein 2 Dihydrotestosterone receptor Nuclear receptor subfamily 3 group C member 4
Type:
Receptor
Mol. Mass.:
99185.27
Organism:
Homo sapiens (Human)
Description:
CHO cells were stably transfected with human AR gene.
Residue:
920
  
Inhibitor
Name:
BDBM50204249
Synonyms:
CHEMBL3935242
Type:
Small organic molecule
Emp. Form.:
C17H15F3N2O3S
Mol. Mass.:
384.373
SMILES:
[H][C@]12CC[C@]([H])(C1=O)[C@]1(C)[C@@]2([H])CN(c2ccc(C#N)c(c2)C(F)(F)F)S1(=O)=O
: