Target
Phosphodiesterase
Ligand
BDBM50204594
Substrate
Meas. Tech.
ChEMBL_1627692 (CHEMBL3870213)
Ki
0.570000±n/a nM
Citation
 Abdel-Magid, AF Potential Treatment of Cognitive Impairment in Schizophrenia by Phosphodiesterase 2 (PDE2) Inhibitors. ACS Med Chem Lett 8:17-18 (2017)  
Target
Name:
Phosphodiesterase
Synonyms:
PDE2A3 | Phosphodiesterase A3 (PDE2A3)
Type:
Enzyme Catalytic Domain
Mol. Mass.:
105547.91
Organism:
Macaca mulatta (Rhesus macaque)
Description:
Residue:
941
  
Inhibitor
Name:
BDBM50204594
Synonyms:
CHEMBL3980015 | US10285989, Example 143
Type:
Small organic molecule
Emp. Form.:
C16H17F3N4O2S
Mol. Mass.:
386.392
SMILES:
C[C@@H](NC(=O)c1cc(=O)[nH]c(n1)N(C)C)c1ccc(SC(F)(F)F)cc1
: