Target
Xanthine dehydrogenase/oxidase
Ligand
BDBM50424970
Substrate
Meas. Tech.
ChEMBL_1627749 (CHEMBL3870270)
IC50
19±n/a nM
Citation
 Ao, GZZhou, MZLi, YYLi, SNWang, HNWan, QWLi, HQHu, QH Discovery of novel curcumin derivatives targeting xanthine oxidase and urate transporter 1 as anti-hyperuricemic agents. Bioorg Med Chem 25:166-174 (2017)  
Target
Name:
Xanthine dehydrogenase/oxidase
Synonyms:
XD XDHA XO Xanthine dehydrogenase/oxidase | Xanthine oxidase
Type:
Enzyme
Mol. Mass.:
146441.21
Organism:
Homo sapiens (Human)
Description:
P47989
Residue:
1333
  
Inhibitor
Name:
BDBM50424970
Synonyms:
CHEMBL2316145 | US9409845, Table 1, Compound 6: (2E,6E)-2-(3,5-dimethoxybenzylidene)-6-(3-bromobenzylidene)cyclohexanone
Type:
Small organic molecule
Emp. Form.:
C22H21BrO3
Mol. Mass.:
413.304
SMILES:
COc1cc(OC)cc(\C=C2/CCC\C(=C/c3cccc(Br)c3)C2=O)c1
: