Target
Alpha-mannosidase
Ligand
BDBM50204661
Substrate
Meas. Tech.
ChEMBL_1627853 (CHEMBL3870438)
Ki
510000±n/a nM
Citation
 Olsen, JIPlata, GBPadrón, JMLópez, ÓBols, MFernández-Bolaños, JG Selenoureido-iminosugars: A new family of multitarget drugs. Eur J Med Chem 123:155-160 (2016)  
Target
Name:
Alpha-mannosidase
Synonyms:
Alpha-mannosidase Alpha-mannosidase, light subunit Jbalpha-man | MANA_CANEN
Type:
PROTEIN
Mol. Mass.:
108565.93
Organism:
Canavalia ensiformis
Description:
ChEMBL_109557
Residue:
959
  
Inhibitor
Name:
BDBM50204661
Synonyms:
CHEMBL3892394
Type:
Small organic molecule
Emp. Form.:
C19H31N3O5Se
Mol. Mass.:
460.43
SMILES:
COc1ccc(NC(=[Se])NCCCCCN2C[C@H](O)[C@@H](O)[C@H](O)[C@H]2CO)cc1
: