Target
Cholinesterase
Ligand
BDBM50205671
Substrate
Meas. Tech.
ChEMBL_1628516 (CHEMBL3871101)
IC50
3060±n/a nM
Citation
 Horton, WSood, APeerannawar, SKugyela, NKulkarni, ATulsan, RTran, CDSoule, JLeVine, HTörök, BTörök, M Synthesis and application ofß-carbolines as novel multi-functional anti-Alzheimer's disease agents. Bioorg Med Chem Lett 27:232-236 (2017)  
Target
Name:
Cholinesterase
Synonyms:
Acylcholine acylhydrolase Butyrylcholine esterase (BChE) Butyrylcholinesterase (BuChE) CHLE_HUMAN Cholinesterases Pseudocholinesterase
Type:
Homotetramer
Mol. Mass.:
68422.27
Organism:
Homo sapiens (Human)
Description:
P06276
Residue:
602
  
Inhibitor
Name:
BDBM50205671
Synonyms:
CHEMBL3938663
Type:
Small organic molecule
Emp. Form.:
C18H14N2
Mol. Mass.:
258.3172
SMILES:
Cc1ccc2[nH]c3c(nccc3c2c1)-c1ccccc1
: