Target
Cholinesterase
Ligand
BDBM50205675
Substrate
Meas. Tech.
ChEMBL_1628516 (CHEMBL3871101)
IC50
220±n/a nM
Citation
 Horton, WSood, APeerannawar, SKugyela, NKulkarni, ATulsan, RTran, CDSoule, JLeVine, HTörök, BTörök, M Synthesis and application ofß-carbolines as novel multi-functional anti-Alzheimer's disease agents. Bioorg Med Chem Lett 27:232-236 (2017)  
Target
Name:
Cholinesterase
Synonyms:
Acylcholine acylhydrolase Butyrylcholine esterase (BChE) Butyrylcholinesterase (BuChE) CHLE_HUMAN Cholinesterases Pseudocholinesterase
Type:
Homotetramer
Mol. Mass.:
68422.27
Organism:
Homo sapiens (Human)
Description:
P06276
Residue:
602
  
Inhibitor
Name:
BDBM50205675
Synonyms:
CHEMBL3954861
Type:
Small organic molecule
Emp. Form.:
C21H14N2
Mol. Mass.:
294.3493
SMILES:
c1ccc2c(c1)[nH]c1c(nccc21)-c1cccc2ccccc12
: