Target
Neuraminidase
Ligand
BDBM50206323
Substrate
Meas. Tech.
ChEMBL_1628825 (CHEMBL3871451)
IC50
9.9±n/a nM
Citation
 Das, AAdak, AKPonnapalli, KLin, CHHsu, KCYang, JMHsu, TALin, CC Design and synthesis of 1,2,3-triazole-containing N-acyl zanamivir analogs as potent neuraminidase inhibitors. Eur J Med Chem 123:397-406 (2016)  
Target
Name:
Neuraminidase
Synonyms:
NA | NRAM_I33A0
Type:
PROTEIN
Mol. Mass.:
49687.56
Organism:
Influenza A virus (strain A/Wilson-Smith/1933 H1N1) (Influenza A virus(strain A/WS/1933 H1N1))
Description:
ChEMBL_881601
Residue:
453
  
Inhibitor
Name:
BDBM50206323
Synonyms:
CHEMBL3924843
Type:
Small organic molecule
Emp. Form.:
C22H27N7O8
Mol. Mass.:
517.4919
SMILES:
CC(=O)N[C@@H]1[C@@H](NC(=N)NC(=O)Cn2cc(nn2)-c2ccccc2)C=C(OC1[C@H](O)[C@H](O)CO)C(O)=O
: