Target
Neuraminidase
Ligand
BDBM50206356
Substrate
Meas. Tech.
ChEMBL_1628824 (CHEMBL3871450)
IC50
14±n/a nM
Citation
 Das, AAdak, AKPonnapalli, KLin, CHHsu, KCYang, JMHsu, TALin, CC Design and synthesis of 1,2,3-triazole-containing N-acyl zanamivir analogs as potent neuraminidase inhibitors. Eur J Med Chem 123:397-406 (2016)  
Target
Name:
Neuraminidase
Synonyms:
NA | NRAM_I33A0
Type:
PROTEIN
Mol. Mass.:
49687.56
Organism:
Influenza A virus (strain A/Wilson-Smith/1933 H1N1) (Influenza A virus(strain A/WS/1933 H1N1))
Description:
ChEMBL_881601
Residue:
453
  
Inhibitor
Name:
BDBM50206356
Synonyms:
CHEMBL3955100
Type:
Small organic molecule
Emp. Form.:
C23H29N7O8
Mol. Mass.:
531.5185
SMILES:
[H][C@]1(OC(=C[C@H](NC(=N)NC(=O)Cn2cc(nn2)-c2ccc(C)cc2)[C@H]1NC(C)=O)C(O)=O)[C@H](O)[C@H](O)CO
: