Target
5-hydroxytryptamine receptor 1A
Ligand
BDBM50206759
Substrate
Meas. Tech.
ChEMBL_1629238 (CHEMBL3871864)
Ki
1.0±n/a nM
Citation
 Yoshinaga, HMasumoto, SKoyama, KKinomura, NMatsumoto, YKato, TBaba, SMatsumoto, KHorisawa, TOki, HYabuuchi, KKodo, T Discovery of SMP-304, a novel benzylpiperidine derivative with serotonin transporter inhibitory activity and 5-HT Bioorg Med Chem 25:293-304 (2017)  
Target
Name:
5-hydroxytryptamine receptor 1A
Synonyms:
5-HT-1A 5-hydroxytryptamine receptor 1A (5-HT-1A) ADRB2RL1 Dopamine D2 receptor and serotonin 1a receptor HTR1A | Serotonin receptor 1A
Type:
Mol. Mass.:
46122.49
Organism:
Homo sapiens (Human)
Description:
Residue:
422
  
Inhibitor
Name:
BDBM50206759
Synonyms:
CHEMBL3964504
Type:
Small organic molecule
Emp. Form.:
C21H25BrFNO
Mol. Mass.:
406.332
SMILES:
COc1ccc(Br)c(CC2CCN(CCc3ccc(F)cc3)CC2)c1
: