Target
Glucocorticoid receptor
Ligand
BDBM50206950
Substrate
Meas. Tech.
ChEMBL_1629477 (CHEMBL3872103)
IC50
0.070000±n/a nM
Citation
 Jin, ZLin, HSrinivasan, SNwachukwu, JCBruno, NGriffin, PRNettles, KWKamenecka, TM Synthesis of novel steroidal agonists, partial agonists, and antagonists for the glucocorticoid receptor. Bioorg Med Chem Lett 27:347-353 (2017)  
Target
Name:
Glucocorticoid receptor
Synonyms:
GCR_HUMAN GRL Glucocorticoid receptor (GRFP) Nuclear receptor subfamily 3 group C member 1
Type:
Enzyme
Mol. Mass.:
85656.87
Organism:
Homo sapiens (Human)
Description:
P04150
Residue:
777
  
Inhibitor
Name:
BDBM50206950
Synonyms:
CHEMBL3933702
Type:
Small organic molecule
Emp. Form.:
C35H37ClN2O3
Mol. Mass.:
569.133
SMILES:
[H][C@@]12CC[C@@](O)(C#CC)[C@@]1(C)C[C@H](OCc1ccc(Cl)cc1)[C@]1([H])c3ccc(cc3CC[C@@]21[H])C(=O)Nc1cccnc1C
: