Target
5-hydroxytryptamine receptor 2A
Ligand
BDBM50207145
Substrate
Meas. Tech.
ChEMBL_1630076 (CHEMBL3872782)
IC50
32±n/a nM
Citation
 Chen, XWSun, YYFu, LLi, JQ Synthesis and pharmacological characterization of novel N-(trans-4-(2-(4-(benzo[d]isothiazol-3-yl)piperazin-1-yl)ethyl)cyclohexyl)amides as potential multireceptor atypical antipsychotics. Eur J Med Chem 123:332-353 (2016)  
Target
Name:
5-hydroxytryptamine receptor 2A
Synonyms:
5-HT-2 5-HT2A 5-hydroxytryptamine receptor 2A (5HT-2A) 5HT2A_HUMAN HTR2A | Serotonin receptor 2A
Type:
undefined
Mol. Mass.:
52607.65
Organism:
Homo sapiens (Human)
Description:
P28223
Residue:
471
  
Inhibitor
Name:
BDBM50207145
Synonyms:
CHEMBL3946995 | US9550741, I-1
Type:
Small organic molecule
Emp. Form.:
C24H30N4O2S
Mol. Mass.:
438.586
SMILES:
O=C(N[C@H]1CC[C@H](CCN2CCN(CC2)c2nsc3ccccc23)CC1)c1ccco1
: