Target
Transient receptor potential cation channel subfamily M member 8
Ligand
BDBM50207657
Substrate
Meas. Tech.
ChEMBL_1632145 (CHEMBL3874851)
IC50
240±n/a nM
Citation
 Kobayashi, JIHirasawa, HOzawa, TOzawa, TTakeda, HFujimori, YNakanishi, OKamada, NIkeda, T Synthesis and optimization of novela-phenylglycinamides as selective TRPM8 antagonists. Bioorg Med Chem 25:727-742 (2017)  
Target
Name:
Transient receptor potential cation channel subfamily M member 8
Synonyms:
LTRPC6 TRPM8_HUMAN Transient receptor potential M8 protein (TRPM8) Transient receptor potential cation channel subfamily M member 8 (TRPM8)
Type:
Enzyme
Mol. Mass.:
127693.26
Organism:
Homo sapiens (Human)
Description:
Q7Z2W7
Residue:
1104
  
Inhibitor
Name:
BDBM50207657
Synonyms:
CHEMBL3917717
Type:
Small organic molecule
Emp. Form.:
C24H24N2O3
Mol. Mass.:
388.459
SMILES:
COc1cccc(c1)[C@@H](C)N([C@@H](C(N)=O)c1ccccc1)C(=O)c1ccccc1
: